设为首页收藏本站论坛APP下载
查看: 898|回复: 2

安装Zabbix 报错。

[复制链接]

3

主题

3

帖子

38

积分

初级VIP会员

Rank: 1

积分
38
发表于 2020-4-28 21:51:59 | 显示全部楼层 |阅读模式
1金币
Making install in zbxcommshigh
make[3]: Entering directory '/usr/local/src/zabbix-3.4.15/src/libs/zbxcommshigh'
make[4]: Entering directory '/usr/local/src/zabbix-3.4.15/src/libs/zbxcommshigh'
make[4]: Nothing to be done for 'install-exec-am'.
make[4]: Nothing to be done for 'install-data-am'.
make[4]: Leaving directory '/usr/local/src/zabbix-3.4.15/src/libs/zbxcommshigh'
make[3]: Leaving directory '/usr/local/src/zabbix-3.4.15/src/libs/zbxcommshigh'
Making install in zbxdb
make[3]: Entering directory '/usr/local/src/zabbix-3.4.15/src/libs/zbxdb'
gcc -DHAVE_CONFIG_H -I. -I../../../include    -I/usr/include/mysql -m64     -g -O2  -MT libzbxdb_a-db.o -MD -MP -MF .deps/libzbxdb_a-db.Tpo -c -o libzbxdb_a-db.o `test -f 'db.c' || echo './'`db.c
db.c: In function ‘zbx_db_connect’:
db.c:288:2: error: unknown type name ‘my_bool’; did you mean ‘bool’?
  my_bool  mysql_reconnect = 1;
  ^~~~~~~
  bool
make[3]: *** [Makefile:440: libzbxdb_a-db.o] Error 1
make[3]: Leaving directory '/usr/local/src/zabbix-3.4.15/src/libs/zbxdb'
make[2]: *** [Makefile:499: install-recursive] Error 1
make[2]: Leaving directory '/usr/local/src/zabbix-3.4.15/src/libs'
make[1]: *** [Makefile:471: install-recursive] Error 1
make[1]: Leaving directory '/usr/local/src/zabbix-3.4.15/src'
make: *** [Makefile:477: install-recursive] Error 1

安装Zabbix 报错。求解




回复

使用道具 举报

29

主题

59

帖子

197

积分

中级VIP会员

Rank: 2

积分
197
发表于 2020-8-28 11:38:12 | 显示全部楼层
目测你设置的msyql连接是做了代理的。但是实际上mysql是否设置了代理呢?
回复

使用道具 举报

1

主题

4

帖子

36

积分

初级VIP会员

Rank: 1

积分
36
发表于 2020-10-25 20:20:46 | 显示全部楼层
db.c:288:2: error: unknown type name ‘my_bool’; did you mean ‘bool’?
  my_bool  mysql_reconnect = 1;  根据报错查询
回复

使用道具 举报

您需要登录后才可以回帖 登录 | 使用vip格式注册

本版积分规则

快速回复 返回顶部 返回列表